Report generated on 26-May-2015 at 05:14:25 by gaiatest-v2.2 version 0.1

Configuration

Device firmware (base) L1TC100118D0
Device firmware (date) 25 May 2015 16:11:54
Device firmware (incremental) eng.cltbld.20150525.041143
Device firmware (release) 4.4.2
Device identifier flame
Gaia date 25 May 2015 10:01:14
Gaia revision 144673a41358
Gecko build 20150525002504
Gecko revision c4db2af40b1b
Gecko version 37.0

Summary

45 tests ran in 3952 seconds.
37 passed, 130 skipped, 0 failed, 8 errors.
0 expected failures, 0 unexpected passes.

Results

Result Class Test Name Duration Links
Passed test_browser_cell_data.TestBrowserCellData test_browser_cell_data 95.1
Passed test_browser_lan.TestBrowserLAN test_browser_lan 95.1
Passed test_browser_play_video.TestVideo test_play_video 94.0
Passed test_calendar_new_event_appears_on_all_calendar_views.TestCalendar test_that_new_event_appears_on_all_calendar_views 90.8
Passed test_camera_capture_video.TestCamera test_capture_a_video 66.0
Passed test_camera_multiple_shots.TestCameraMultipleShots test_capture_multiple_shots 67.5
Passed test_cards_view_with_two_apps.TestCardsView test_that_app_can_be_launched_from_cards_view 66.4
Error test_clock_create_new_alarm.TestClockCreateNewAlarm test_clock_create_new_alarm 191.0
Traceback (most recent call last):
File "/var/lib/jenkins/workspace/B2G.v2.2.pvt.flame.gaiatest.smoketest/tests/python/gaia-ui-tests/.env/local/lib/python2.7/site-packages/marionette_client_mozilla_b2g37_v2_2-0.1-py2.7.egg/marionette/marionette_test.py", line 268, in run
testMethod()
File "/var/lib/jenkins/workspace/B2G.v2.2.pvt.flame.gaiatest.smoketest/tests/python/gaia-ui-tests/gaiatest/tests/functional/clock/test_clock_create_new_alarm.py", line 92, in test_clock_create_new_alarm
self.alarm_alert.wait_for_alarm_to_trigger()
File "/var/lib/jenkins/workspace/B2G.v2.2.pvt.flame.gaiatest.smoketest/tests/python/gaia-ui-tests/gaiatest/apps/clock/regions/alarm_alert.py", line 19, in wait_for_alarm_to_trigger
expected.element_present(*self._alarm_frame_locator))
File "/var/lib/jenkins/workspace/B2G.v2.2.pvt.flame.gaiatest.smoketest/tests/python/gaia-ui-tests/.env/local/lib/python2.7/site-packages/marionette_client_mozilla_b2g37_v2_2-0.1-py2.7.egg/marionette/wait.py", line 143, in until
cause=last_exc)
TimeoutException: TimeoutException: Timed out after 60.3 seconds
Passed test_add_new_contact.TestContacts test_add_new_contact 79.0
Passed test_edit_contact.TestContacts test_edit_contact 69.9
Passed test_sms_contact.TestContacts test_sms_contact 86.2
Passed test_add_photo_to_contact.TestContacts test_add_photo_from_gallery_to_contact 71.1
Passed test_cost_control_data_alert_mobile.TestCostControlDataAlertMobile test_cost_control_data_alert_mobile 134.2
Passed test_dialer.TestDialer test_dialer_make_call 69.5
Passed test_dialer_receive_call.TestReceiveCall test_receive_call 72.3
Passed test_dialer_receive_call_with_locked_screen.TestReceiveCallScreenLocked test_receive_call_with_locked_screen 83.6
Passed test_setup_basic_gmail.TestSetupGmail test_setup_basic_gmail 86.7
Passed test_setup_and_send_imap_email.TestSetupAndSendIMAPEmail test_setup_and_send_imap_email 161.1
Passed test_IMAP_email_notification.TestEmailNotification test_IMAP_email_notification 122.0
Error test_rocketbar_add_collection_save_bookmark.TestRocketBarAddCollectionSaveBookmark test_rocketbar_add_collection 92.7
Traceback (most recent call last):
File "/var/lib/jenkins/workspace/B2G.v2.2.pvt.flame.gaiatest.smoketest/tests/python/gaia-ui-tests/.env/local/lib/python2.7/site-packages/marionette_client_mozilla_b2g37_v2_2-0.1-py2.7.egg/marionette/marionette_test.py", line 268, in run
testMethod()
File "/var/lib/jenkins/workspace/B2G.v2.2.pvt.flame.gaiatest.smoketest/tests/python/gaia-ui-tests/gaiatest/tests/functional/rocketbar/test_rocketbar_add_collection_save_bookmark.py", line 20, in test_rocketbar_add_collection
collection_activity = contextmenu.tap_add_collection()
File "/var/lib/jenkins/workspace/B2G.v2.2.pvt.flame.gaiatest.smoketest/tests/python/gaia-ui-tests/gaiatest/apps/homescreen/regions/context_menu.py", line 31, in tap_add_collection
return CollectionsActivity(self.marionette)
File "/var/lib/jenkins/workspace/B2G.v2.2.pvt.flame.gaiatest.smoketest/tests/python/gaia-ui-tests/gaiatest/apps/homescreen/regions/collections_activity.py", line 24, in __init__
Wait(self.marionette).until(expected.element_not_displayed(loading))
File "/var/lib/jenkins/workspace/B2G.v2.2.pvt.flame.gaiatest.smoketest/tests/python/gaia-ui-tests/.env/local/lib/python2.7/site-packages/marionette_client_mozilla_b2g37_v2_2-0.1-py2.7.egg/marionette/wait.py", line 143, in until
cause=last_exc)
TimeoutException: TimeoutException: Timed out after 30.3 seconds
Passed test_fmradio_frequency_dialer.TestFMRadioFreqDialer test_radio_frequency_dialer 71.5
Error test_ftu_skip_tour.TestFtu test_ftu_skip_tour 71.5
Traceback (most recent call last):
File "/var/lib/jenkins/workspace/B2G.v2.2.pvt.flame.gaiatest.smoketest/tests/python/gaia-ui-tests/.env/local/lib/python2.7/site-packages/marionette_client_mozilla_b2g37_v2_2-0.1-py2.7.egg/marionette/marionette_test.py", line 268, in run
testMethod()
File "/var/lib/jenkins/workspace/B2G.v2.2.pvt.flame.gaiatest.smoketest/tests/python/gaia-ui-tests/gaiatest/tests/functional/ftu/test_ftu_skip_tour.py", line 53, in test_ftu_skip_tour
self.ftu.connect_to_wifi(ssid, psk, keymanagement)
File "/var/lib/jenkins/workspace/B2G.v2.2.pvt.flame.gaiatest.smoketest/tests/python/gaia-ui-tests/gaiatest/apps/ftu/app.py", line 182, in connect_to_wifi
password_element.send_keys(password)
File "/var/lib/jenkins/workspace/B2G.v2.2.pvt.flame.gaiatest.smoketest/tests/python/gaia-ui-tests/.env/local/lib/python2.7/site-packages/marionette_client_mozilla_b2g37_v2_2-0.1-py2.7.egg/marionette/marionette.py", line 111, in send_keys
for i in range(len(val)):
TypeError: object of type 'NoneType' has no len()
Passed test_ftu_with_tour.TestFtu test_ftu_with_tour 76.2
Passed test_ftu_status_bar.TestFtu test_ftu_status_bar 75.5
Passed test_gallery_view.TestGallery test_gallery_view 62.2
Passed test_gallery_flick.TestGallery test_gallery_full_screen_image_flicks 69.9
Passed test_homescreen_delete_app.TestDeleteApp test_delete_app 103.8
Passed test_homescreen_delete_app_packaged.TestDeleteApp test_delete_app 104.9
Passed test_homescreen_launch_app.TestLaunchApp test_launch_app 90.9
Passed test_homescreen_launch_app_packaged.TestLaunchApp test_launch_app 90.0
Passed test_homescreen_move_app.TestMoveApp test_move_app_position 93.1
Passed test_lockscreen_unlock_to_homescreen.TestLockScreen test_unlock_to_homescreen 56.2
Passed test_lockscreen_unlock_to_camera.TestLockScreen test_unlock_to_camera 61.1
Passed test_lockscreen_unlock_to_camera_with_passcode.TestCameraUnlockWithPasscode test_unlock_to_camera_with_passcode 65.6
Passed test_marketplace_launch.TestMarketplaceLaunch test_marketplace_launch 65.1
Error test_marketplace_packaged_app.TestSearchMarketplaceAndInstallApp test_search_and_install_app 102.2