Report generated on 20-May-2015 at 05:15:09 by gaiatest-v2.2 version 0.1

Configuration

Device firmware (base) L1TC100118D0
Device firmware (date) 19 May 2015 15:55:45
Device firmware (incremental) eng.cltbld.20150519.035534
Device firmware (release) 4.4.2
Device identifier flame
Gaia date 19 May 2015 14:24:24
Gaia revision 732acec6f37d
Gecko build 20150519002500
Gecko revision 1389e6b8c065
Gecko version 37.0

Summary

45 tests ran in 4006 seconds.
36 passed, 130 skipped, 0 failed, 9 errors.
0 expected failures, 0 unexpected passes.

Results

Result Class Test Name Duration Links
Passed test_browser_cell_data.TestBrowserCellData test_browser_cell_data 96.0
Passed test_browser_lan.TestBrowserLAN test_browser_lan 93.4
Passed test_browser_play_video.TestVideo test_play_video 93.7
Passed test_calendar_new_event_appears_on_all_calendar_views.TestCalendar test_that_new_event_appears_on_all_calendar_views 92.6
Passed test_camera_capture_video.TestCamera test_capture_a_video 65.2
Passed test_camera_multiple_shots.TestCameraMultipleShots test_capture_multiple_shots 68.2
Passed test_cards_view_with_two_apps.TestCardsView test_that_app_can_be_launched_from_cards_view 64.1
Error test_clock_create_new_alarm.TestClockCreateNewAlarm test_clock_create_new_alarm 192.3
Traceback (most recent call last):
File "/var/lib/jenkins/workspace/B2G.v2.2.pvt.flame.gaiatest.smoketest/tests/python/gaia-ui-tests/.env/local/lib/python2.7/site-packages/marionette_client_mozilla_b2g37_v2_2-0.1-py2.7.egg/marionette/marionette_test.py", line 268, in run
testMethod()
File "/var/lib/jenkins/workspace/B2G.v2.2.pvt.flame.gaiatest.smoketest/tests/python/gaia-ui-tests/gaiatest/tests/functional/clock/test_clock_create_new_alarm.py", line 92, in test_clock_create_new_alarm
self.alarm_alert.wait_for_alarm_to_trigger()
File "/var/lib/jenkins/workspace/B2G.v2.2.pvt.flame.gaiatest.smoketest/tests/python/gaia-ui-tests/gaiatest/apps/clock/regions/alarm_alert.py", line 19, in wait_for_alarm_to_trigger
expected.element_present(*self._alarm_frame_locator))
File "/var/lib/jenkins/workspace/B2G.v2.2.pvt.flame.gaiatest.smoketest/tests/python/gaia-ui-tests/.env/local/lib/python2.7/site-packages/marionette_client_mozilla_b2g37_v2_2-0.1-py2.7.egg/marionette/wait.py", line 143, in until
cause=last_exc)
TimeoutException: TimeoutException: Timed out after 60.3 seconds
Passed test_add_new_contact.TestContacts test_add_new_contact 76.6
Passed test_edit_contact.TestContacts test_edit_contact 71.4
Passed test_sms_contact.TestContacts test_sms_contact 83.1
Passed test_add_photo_to_contact.TestContacts test_add_photo_from_gallery_to_contact 72.0
Passed test_cost_control_data_alert_mobile.TestCostControlDataAlertMobile test_cost_control_data_alert_mobile 132.5
Passed test_dialer.TestDialer test_dialer_make_call 71.7
Passed test_dialer_receive_call.TestReceiveCall test_receive_call 73.3
Passed test_dialer_receive_call_with_locked_screen.TestReceiveCallScreenLocked test_receive_call_with_locked_screen 82.7
Passed test_setup_basic_gmail.TestSetupGmail test_setup_basic_gmail 83.9
Passed test_setup_and_send_imap_email.TestSetupAndSendIMAPEmail test_setup_and_send_imap_email 156.2
Passed test_IMAP_email_notification.TestEmailNotification test_IMAP_email_notification 121.5
Error test_rocketbar_add_collection_save_bookmark.TestRocketBarAddCollectionSaveBookmark test_rocketbar_add_collection 125.3