Report generated on 26-Mar-2015 at 07:57:53 by gaiatest version 0.32

Configuration

Device firmware (base) L1TC100118D0
Device firmware (date) 25 Mar 2015 16:11:58
Device firmware (incremental) eng.cltbld.20150325.041148
Device firmware (release) 4.4.2
Device identifier flame
Gaia date 25 Mar 2015 11:57:57
Gaia revision aeee2a54caa8
Gecko build 20150325002503
Gecko revision 556aca3e50ac
Gecko version 37.0

Summary

133 tests ran in 9462 seconds.
129 passed, 55 skipped, 2 failed, 2 errors.
0 expected failures, 0 unexpected passes.

Results

Result Class Test Name Duration Links
Passed test_browser_save_image.TestBrowserSaveImage test_browser_save_image 97.0
Passed test_browser_navigation.TestBrowserNavigation test_browser_back_button 85.5
Passed test_browser_bookmark.TestBrowserBookmark test_browser_bookmark 161.1
Passed test_browser_share_link.TestBrowserShareToMessages test_browser_share_to_messages 89.5
Passed test_browser_clear_browsing_history.TestBrowserClearHistory test_browser_clear_history 152.3
Passed test_calendar_flick_through_months.TestCalendar test_calendar_flick_through_months 57.1
Passed test_camera_capture_photo.TestCamera test_capture_a_photo 59.0
Passed test_camera_flash_modes.TestCameraFlashModes test_camera_flash_modes 67.1
Passed test_camera_delete_captured_video.TestPreviewDelete test_capture_and_delete_video 79.7
Passed test_cards_view_kill_apps_with_two_apps.TestCardsViewTwoApps test_kill_app_from_cards_view 66.1
Passed test_clock_set_alarm.TestClockSetAlarm test_clock_set_alarm 115.2
Passed test_call_contact.TestContacts test_call_contact 62.1
Passed test_delete_all_contacts.TestDeleteAllContacts test_delete_all_contacts 62.7
Passed test_default_contact_image.TestDefaultContactImage test_default_contact_image 62.6
Passed test_sort_contacts.TestContacts test_sort_contacts 74.7
Passed test_delete_contact.TestContacts test_delete_contact 88.2
Passed test_add_contact_to_favorites.TestAddContactToFavorite test_add_contact_to_favorite 61.9
Passed test_import_contacts_from_sim.TestImportContactsFromSIM test_import_contacts_from_SIM 78.5
Passed test_export_contacts_to_sdcard.TestExportContactsToSDCard test_export_contacts_to_sdcard 62.6
Passed test_import_contacts_from_sdcard.TestImportContactsFromSDCard test_import_contacts_from_sdcard 66.1
Passed test_import_contacts_from_gmail.TestImportContactsFromGmail test_import_contacts_from_gmail 91.4
Passed test_sync_facebook_contacts.TestImportContactsFromFacebook test_import_contacts_from_facebook 87.6
Passed test_unlink_facebook.TestContacts test_unlink_facebook_contact 82.9
Passed test_import_edit_export_contact.TestImportEditExportContact test_import_edit_export_contact 93.9
Passed test_import_contacts_menu_no_network.TestImportContactsMenuNoNetwork test_import_contacts_menu_no_network 62.6
Passed test_import_gmail_no_network.TestImportGMailNoNetwork test_import_gmail_no_network 86.4
Passed test_cost_control_ftu.TestCostControlFTU test_cost_control_ftu 72.7
Passed test_cost_control_reset_wifi.TestCostControlReset test_cost_control_reset_wifi 108.6
Passed test_dialer_airplane_mode.TestDialerAirplaneMode test_dialer_airplane_mode 68.3
Passed test_MMI.TestMMI test_MMI_code_IMEI 58.8
Passed test_clear_phone_number.TestClearPhoneNumber test_clear_phone_number 63.9
Passed test_dialer_add_contact.TestDialerAddContact test_dialer_add_contact 79.3
Failure test_call_log_groups.TestCallLogGroups test_call_log_groups 67.9
Traceback (most recent call last):
File "/var/lib/jenkins/workspace/B2G.v2.2.pvt.flame.gaiatest.non-smoketest/tests/python/gaia-ui-tests/.env/local/lib/python2.7/site-packages/marionette_client-0.8.6-py2.7.egg/marionette/marionette_test.py", line 268, in run
testMethod()
File "/var/lib/jenkins/workspace/B2G.v2.2.pvt.flame.gaiatest.non-smoketest/tests/python/gaia-ui-tests/gaiatest/tests/functional/dialer/test_call_log_groups.py", line 50, in test_call_log_groups
self.assertEqual('TODAY', group_calls[0].header_text)
AssertionError: 'TODAY' != u'12/01/2014'
Passed test_delete_call_log.TestDeleteCallLog test_delete_call_log 90.3
Passed test_dialer_find_contact.TestDialerFindContact test_dialer_find_contact 65.0
Passed test_dialer_miss_call_from_known_contact_notification.TestReceiveCallFromKnownContactNotification test_dialer_miss_call_from_known_contact_notification 78.2
Passed test_dialer_clear_miss_call_notification.TestDialerClearMissCallNotification test_dialer_clear_miss_call_notification 77.7
Passed test_dialer_receive_call_with_contact_photo.TestReceiveCallWithContactPhoto test_dialer_receive_call_with_contact_photo 64.9
Error test_redial_last_number.TestRedialLastNumber test_redial_last_number 85.4
Traceback (most recent call last):
File "/var/lib/jenkins/workspace/B2G.v2.2.pvt.flame.gaiatest.non-smoketest/tests/python/gaia-ui-tests/.env/local/lib/python2.7/site-packages/marionette_client-0.8.6-py2.7.egg/marionette/marionette_test.py", line 268, in run
testMethod()
File "/var/lib/jenkins/workspace/B2G.v2.2.pvt.flame.gaiatest.non-smoketest/tests/python/gaia-ui-tests/gaiatest/tests/functional/dialer/test_redial_last_number.py", line 33, in test_redial_last_number
keypad.wait_for_phone_number_ready()
File "/var/lib/jenkins/workspace/B2G.v2.2.pvt.flame.gaiatest.non-smoketest/tests/python/gaia-ui-tests/gaiatest/apps/phone/regions/keypad.py", line 105, in wait_for_phone_number_ready
self.wait_for_condition(lambda m: m.find_element(*self._add_new_contact_button_locator).is_enabled())
File "/var/lib/jenkins/workspace/B2G.v2.2.pvt.flame.gaiatest.non-smoketest/tests/python/gaia-ui-tests/gaiatest/apps/base.py", line 56, in wait_for_condition
Wait(self.marionette, timeout).until(method, message=message)
File "/var/lib/jenkins/workspace/B2G.v2.2.pvt.flame.gaiatest.non-smoketest/tests/python/gaia-ui-tests/.env/local/lib/python2.7/site-packages/marionette_client-0.8.6-py2.7.egg/marionette/wait.py", line 143, in until
cause=last_exc)
TimeoutException: TimeoutException: Timed out after 30.0 seconds
Passed test_rocketbar_search.TestRocketBarSearch test_launch_rocketbar_search 65.1
Passed test_rocketbar_offline_behavior.TestRocketBarOffline test_rocketbar_offline_behavior 64.3
Passed test_fmradio_add_remove_from_favorites.TestFMRadioAddRemoveFavorites test_add_remove_from_favorites 120.0
Passed test_fmradio_turn_on_off.TestFMRadioTurnOnOff test_turn_radio_on_off 66.2
Passed test_fmradio_airplane_mode.TestFMRadioAirplaneMode test_radio_airplane_mode 55.0
Passed test_gallery_empty.TestGalleryEmpty test_empty_gallery 52.4
Passed test_gallery_delete_image.TestGalleryDelete test_gallery_delete_image 57.4
Passed test_gallery_delete_multiple_images.TestGalleryMultiDelete test_gallery_delete_image 58.2
Passed test_gallery_cancel_delete_multiple_images.TestGalleryMultiDelete test_gallery_delete_image 60.5
Passed test_gallery_edit_photo.TestGalleryEditPhoto test_gallery_edit_photo 62.8
Passed test_gallery_crop_photo.TestGalleryCropPhoto test_gallery_crop_photo 63.5
Passed test_gallery_handle_invalid_file.TestGalleryHandleInvalidPhoto test_gallery_handle_load_corrupt_file_corrupt_jpg 57.5
Passed test_gallery_handle_invalid_file.TestGalleryHandleInvalidPhoto test_gallery_handle_load_corrupt_file_text_file 87.0
Passed test_gallery_handle_invalid_file.TestGalleryHandleInvalidPhoto test_gallery_handle_load_corrupt_file_truncated_bmp 83.1
Passed test_gallery_handle_invalid_file.TestGalleryHandleInvalidPhoto test_gallery_handle_load_corrupt_file_truncated_gif 84.8
Passed test_gallery_handle_invalid_file.TestGalleryHandleInvalidPhoto test_gallery_handle_load_corrupt_file_truncated_jpg 85.9
Passed test_gallery_handle_invalid_file.TestGalleryHandleInvalidPhoto test_gallery_handle_load_corrupt_file_truncated_png 85.5
Passed test_gallery_handle_invalid_file.TestGalleryHandleInvalidPhoto test_gallery_handle_load_corrupt_file_zero_length_file 85.3
Passed test_gallery_handle_valid_image_file.TestGalleryHandleValidPhoto test_gallery_open_valid_image_file_animated_gif 56.1
Passed test_gallery_handle_valid_image_file.TestGalleryHandleValidPhoto test_gallery_open_valid_image_file_animated_png 56.4
Passed test_gallery_handle_valid_image_file.TestGalleryHandleValidPhoto test_gallery_open_valid_image_file_load_bmp 54.6
Passed test_gallery_handle_valid_image_file.TestGalleryHandleValidPhoto test_gallery_open_valid_image_file_load_gif 55.7
Passed test_gallery_handle_valid_image_file.TestGalleryHandleValidPhoto test_gallery_open_valid_image_file_load_jpg 60.5
Passed test_gallery_handle_valid_image_file.TestGalleryHandleValidPhoto test_gallery_open_valid_image_file_load_png 56.6
Passed test_gallery_handle_valid_image_file.TestGalleryHandleValidPhoto test_gallery_open_valid_image_file_load_progressive_jpg 57.7
Passed test_gallery_handle_valid_image_file.TestGalleryHandleValidPhoto test_gallery_open_valid_image_file_load_transparent_background_png 56.3
Passed test_gallery_share_picture.TestGallerySharePicture test_gallery_share_to_messages 62.8
Passed test_gallery_switch_to_camera.TestGallery test_gallery_switch_to_camera 68.8
Passed test_gallery_switch_to_camera_main_view.TestGallery test_gallery_view 65.5
Passed test_homescreen_column_layout.TestHomescreenLayout test_homescreen_column_layout 67.7
Passed test_homescreen_change_wallpaper.TestHomescreenChangeWallpaper test_homescreen_change_wallpaper_from_gallery 64.9
Passed test_homescreen_divider.TestDivider test_create_delete_divider 69.0
Passed test_homescreen_edit_mode.TestEditMode test_access_and_leave_edit_mode 60.0
Passed test_keyboard.TestKeyboard test_keyboard_basic 92.7
Passed test_number_keyboard.TestNumberKeyboard test_number_keyboard 61.2
Passed test_keyboard_predictive_key.TestKeyboardPredictiveKey test_keyboard_predictive_key 81.1
Passed test_email_keyboard.TestEmailKeyboard test_basic_email_keyboard 69.3
Passed test_keyboard_bug_1073870.TestKeyboardBug1073870 test_keyboard_bug_1073870 65.0
Passed test_lockscreen_unlock_to_homescreen_with_passcode.TestLockScreen test_unlock_to_homescreen_with_passcode 60.9
Passed test_lockscreen_unlock_to_emergency_call_screen.TestLockScreen test_unlock_to_emergency_call_screen 59.7
Passed test_lockscreen_notification.TestLockScreen test_lock_screen_notification 55.5
Passed test_lockscreen_wake_with_notification.TestLockScreenNotification test_lock_screen_wake_with_notification 57.8
Passed test_add_to_an_existing_contact_from_messages.TestSmsAddToExistingContact test_sms_add_number_to_existing_contact 77.3
Passed test_add_to_new_contact_from_messages.TestSmsCreateContact test_sms_create_new_contact 90.4
Passed test_sms_add_contact.TestSmsAddContact test_sms_add_contact 79.9
Passed test_sms_to_dialer.TestDialerFromMessage test_dialer_from_message 67.1
Passed test_sms_contact_match.TestContactMatch test_contact_match 68.0
Passed test_sms_contact_input_validation.TestContactValidation test_sms_contact_validation 75.5
Error test_sms_notification.TestSmsNotification test_sms_notification 57.3